Target
Acetyl-CoA carboxylase 2
Ligand
BDBM496972
Substrate
Meas. Tech.
In Vitro Acetyl-CoA Carboxylase (ACC) Inhibition Assay
IC50
55±n/a nM
Citation
 Zhang, JLiao, HWang, PWang, P Compounds and their uses as ACC inhibitors US Patent  US10995099 Publication Date 5/4/2021 
Target
Name:
Acetyl-CoA carboxylase 2
Synonyms:
ACACB ACC-beta ACCB Acetyl-CoA carboxylase 2 Acetyl-CoA carboxylase 2 (ACC2)
Type:
Protein
Mol. Mass.:
276535.21
Organism:
Homo sapiens (Human)
Description:
O00763
Residue:
2458
  
Inhibitor
Name:
BDBM496972
Synonyms:
US10995099, Example 62
Type:
Small organic molecule
Emp. Form.:
C27H32BrN3O6S
Mol. Mass.:
606.528
SMILES:
CNC(=O)CC1(CC1)n1c(=O)n(C[C@H](OC2CCOCC2)c2ccccc2OC)c2sc(Br)c(C)c2c1=O
: