Target
Acetyl-CoA carboxylase 1
Ligand
BDBM496974
Substrate
Meas. Tech.
In Vitro Acetyl-CoA Carboxylase (ACC) Inhibition Assay
IC50
5.50±n/a nM
Citation
 Zhang, JLiao, HWang, PWang, P Compounds and their uses as ACC inhibitors US Patent  US10995099 Publication Date 5/4/2021 
Target
Name:
Acetyl-CoA carboxylase 1
Synonyms:
ACAC ACACA_HUMAN ACC1 Acetyl-CoA carboxylase 1 | Acetyl-CoA carboxylase 1 (ACC1)
Type:
Protein
Mol. Mass.:
265543.22
Organism:
Homo sapiens (Human)
Description:
Q13085
Residue:
2346
  
Inhibitor
Name:
BDBM496974
Synonyms:
US10995099, Example 64
Type:
Small organic molecule
Emp. Form.:
C29H32N4O7S
Mol. Mass.:
580.652
SMILES:
COc1ccccc1[C@H](Cn1c2sc(c(C)c2c(=O)n(c1=O)C1(CC(N)=O)CC1)-c1ncco1)OC1CCOCC1
: