Target
Acetyl-CoA carboxylase 2
Ligand
BDBM496978
Substrate
Meas. Tech.
In Vitro Acetyl-CoA Carboxylase (ACC) Inhibition Assay
IC50
550±n/a nM
Citation
 Zhang, JLiao, HWang, PWang, P Compounds and their uses as ACC inhibitors US Patent  US10995099 Publication Date 5/4/2021 
Target
Name:
Acetyl-CoA carboxylase 2
Synonyms:
ACACB ACC-beta ACCB Acetyl-CoA carboxylase 2 Acetyl-CoA carboxylase 2 (ACC2)
Type:
Protein
Mol. Mass.:
276535.21
Organism:
Homo sapiens (Human)
Description:
O00763
Residue:
2458
  
Inhibitor
Name:
BDBM496978
Synonyms:
US10995099, Example 68
Type:
Small organic molecule
Emp. Form.:
C29H37BrN2O7S
Mol. Mass.:
637.582
SMILES:
COc1ccccc1[C@H](Cn1c2sc(Br)c(C)c2c(=O)n(c1=O)C(C)(C)C(=O)OC(C)(C)C)OC1CCOCC1
: