Target
Acetyl-CoA carboxylase 1
Ligand
BDBM496979
Substrate
Meas. Tech.
In Vitro Acetyl-CoA Carboxylase (ACC) Inhibition Assay
IC50
<1.000±n/a nM
Citation
 Zhang, JLiao, HWang, PWang, P Compounds and their uses as ACC inhibitors US Patent  US10995099 Publication Date 5/4/2021 
Target
Name:
Acetyl-CoA carboxylase 1
Synonyms:
ACAC ACACA_HUMAN ACC1 Acetyl-CoA carboxylase 1 | Acetyl-CoA carboxylase 1 (ACC1)
Type:
Protein
Mol. Mass.:
265543.22
Organism:
Homo sapiens (Human)
Description:
Q13085
Residue:
2346
  
Inhibitor
Name:
BDBM496979
Synonyms:
US10995099, Example 69
Type:
Small organic molecule
Emp. Form.:
C29H31N3O8S
Mol. Mass.:
581.637
SMILES:
COc1ccccc1[C@H](Cn1c2sc(c(C)c2c(=O)n(C2CCC2C(O)=O)c1=O)-c1ncco1)OC1CCOCC1
: