Target
GTPase KRas [G12D,Q61H]
Ligand
BDBM485660
Substrate
Meas. Tech.
Inhibition Assay
IC50
20500±n/a nM
Citation
 Hadari, YRCarta, LSchmertzler, MWilliams, TMReynolds, CHHutcheson, R Compounds that interact with the Ras superfamily for the treatment of cancers, inflammatory diseases, rasopathies, and fibrotic disease US Patent  US11000515 Publication Date 5/11/2021 
Target
Name:
GTPase KRas [G12D,Q61H]
Synonyms:
GTPase KRas (G12D, Q61H) KRAS2 RASK_HUMAN
Type:
Enzyme Catalytic Domain
Mol. Mass.:
21722.64
Organism:
Homo sapiens (Human)
Description:
P01116[G12D,Q61H]
Residue:
189
  
Inhibitor
Name:
BDBM485660
Synonyms:
US10940139, Example 02704 US11213515, TABLE 7.255 | US11541041, Compound Table 7.234
Type:
Small organic molecule
Emp. Form.:
C11H7N3OS
Mol. Mass.:
229.258
SMILES:
Oc1nc(nc2sccc12)-c1ccccn1
: