Target
Tyrosine-protein kinase JAK1 [850-1154]
Ligand
BDBM103735
Substrate
Meas. Tech.
JAK1 Inhibition Assay
IC50
334±n/a nM
Citation
 Menet, CJSmits, KK Compound useful for the treatment of degenerative and inflammatory diseases US Patent  US11000528 Publication Date 5/11/2021 
Target
Name:
Tyrosine-protein kinase JAK1 [850-1154]
Synonyms:
JAK1 JAK1B Tyrosine-protein kinase JAK1 (850-1154)
Type:
Enzyme Catalytic Domain
Mol. Mass.:
34949.64
Organism:
Description:
aa 850-1154
Residue:
305
 
Inhibitor
Name:
BDBM103735
Synonyms:
US10206907, Compound 141 US8563545, 9
Type:
Small organic molecule
Emp. Form.:
C23H26N6O2
Mol. Mass.:
418.4915
SMILES:
CC(=O)N1CCN(Cc2ccc(cc2)-c2cccc3nc(NC(=O)C4CC4)nn23)CC1
: