Target
Tyrosine-protein kinase JAK1 [850-1154]
Ligand
BDBM103737
Substrate
Meas. Tech.
JAK1 Inhibition Assay
IC50
7.69±n/a nM
Citation
 Menet, CJSmits, KK Compound useful for the treatment of degenerative and inflammatory diseases US Patent  US11000528 Publication Date 5/11/2021 
Target
Name:
Tyrosine-protein kinase JAK1 [850-1154]
Synonyms:
JAK1 JAK1B Tyrosine-protein kinase JAK1 (850-1154)
Type:
Enzyme Catalytic Domain
Mol. Mass.:
34949.64
Organism:
Description:
aa 850-1154
Residue:
305
 
Inhibitor
Name:
BDBM103737
Synonyms:
US10206907, Compound 234 US8563545, 11
Type:
Small organic molecule
Emp. Form.:
C22H23F2N5O
Mol. Mass.:
411.4477
SMILES:
FC1(F)CCN(Cc2ccc(cc2)-c2cccc3nc(NC(=O)C4CC4)nn23)CC1
: