Target
Tyrosine-protein kinase JAK3 [781-1124]
Ligand
BDBM103728
Substrate
Meas. Tech.
JAK3 Inhibition Assay
IC50
2843±n/a nM
Citation
 Menet, CJSmits, KK Compound useful for the treatment of degenerative and inflammatory diseases US Patent  US11000528 Publication Date 5/11/2021 
Target
Name:
Tyrosine-protein kinase JAK3 [781-1124]
Synonyms:
JAK3 JAK3_HUMAN Tyrosine-protein kinase JAK3 Tyrosine-protein kinase JAK3 (aa 781-1124)
Type:
Mol. Mass.:
38772.27
Organism:
Homo sapiens (Human)
Description:
P52333[781-1124]
Residue:
344
  
Inhibitor
Name:
BDBM103728
Synonyms:
US10206907, Compound 18 US8563545, 2
Type:
Small organic molecule
Emp. Form.:
C21H23N5O2
Mol. Mass.:
377.4396
SMILES:
O=C(Nc1nc2cccc(-c3ccc(CN4CCOCC4)cc3)n2n1)C1CC1
: