Target
Serine protease HTRA1
Ligand
BDBM496995
Substrate
Meas. Tech.
Enzyme Inhibition Assay
IC50
0.933±n/a nM
Citation
 Hornsperger, BMaerki, HPMohr, PReutlinger, MRudolph, M Difluoroketamide derivatives as HTRA1 inhibitors US Patent  US11001555 Publication Date 5/11/2021 
Target
Name:
Serine protease HTRA1
Synonyms:
HTRA HTRA1_HUMAN | PRSS11
Type:
Protein
Mol. Mass.:
51293.95
Organism:
Homo sapiens (Human)
Description:
Q92743
Residue:
480
  
Inhibitor
Name:
BDBM496995
Synonyms:
US11001555, Example 18
Type:
Small organic molecule
Emp. Form.:
C37H37Cl3F5N3O6S
Mol. Mass.:
853.122
SMILES:
COc1ccc(CS[C@@H]2C[C@H](N(C2)C(=O)[C@@H](Cc2cccc(Cl)c2)Oc2cc(Cl)cc(Cl)c2)C(=O)N[C@@H](C(C)C)C(=O)C(F)(F)C(=O)NCC(F)(F)F)cc1
: