Target
Serine protease HTRA1
Ligand
BDBM496996
Substrate
Meas. Tech.
Enzyme Inhibition Assay
IC50
1.06±n/a nM
Citation
 Hornsperger, BMaerki, HPMohr, PReutlinger, MRudolph, M Difluoroketamide derivatives as HTRA1 inhibitors US Patent  US11001555 Publication Date 5/11/2021 
Target
Name:
Serine protease HTRA1
Synonyms:
HTRA HTRA1_HUMAN | PRSS11
Type:
Protein
Mol. Mass.:
51293.95
Organism:
Homo sapiens (Human)
Description:
Q92743
Residue:
480
  
Inhibitor
Name:
BDBM496996
Synonyms:
(2S,4R)-1-[(2S)-2-[[2-(3-Chlorophenyl)-2,2-difluoroacetyl]amino]-3-hydroxypropanoyl]-N-[(3S)-5,5-difluoro-2-methyl-4,6-dioxo-6-(2,2,2-trifluoroethylamino)hexan-3-yl]-4-[(4-methoxyphenyl)methylsulfonyl]pyrrolidine-2-carboxamide | US11001555, Example 20
Type:
Small organic molecule
Emp. Form.:
C33H36ClF7N4O9S
Mol. Mass.:
833.167
SMILES:
COc1ccc(CS(=O)(=O)[C@@H]2C[C@H](N(C2)C(=O)[C@H](CO)NC(=O)C(F)(F)c2cccc(Cl)c2)C(=O)N[C@@H](C(C)C)C(=O)C(F)(F)C(=O)NCC(F)(F)F)cc1
: