Target
Tyrosine-protein phosphatase non-receptor type 11
Ligand
BDBM497091
Substrate
Meas. Tech.
Biochemical Assay
IC50
>10000±n/a nM
Citation
 Jorand-Lebrun, CBoivin, RJohnson, TWang, YXiao, YChen, XLinde, NMusch, DKumar, D Pyrimidinone derivatives as SHP2 antagonists US Patent  US11001561 Publication Date 5/11/2021 
Target
Name:
Tyrosine-protein phosphatase non-receptor type 11
Synonyms:
PTN11_HUMAN PTP-2C PTPN11 Protein tyrosine phosphatase (PTP) Shp2 Protein-tyrosine phosphatase 2C SHP2 Src homology phosphatase 2 (SHP-2) Tyrosine-protein phosphatase non-receptor type 11 (PTPN11) Tyrosine-protein phosphatase non-receptor type 11 (SHP2)
Type:
Protein phosphatase
Mol. Mass.:
68443.59
Organism:
Homo sapiens (Human)
Description:
Q06124
Residue:
597
  
Inhibitor
Name:
BDBM497091
Synonyms:
US11001561, Compound 74d
Type:
Small organic molecule
Emp. Form.:
C25H28Cl2N4O
Mol. Mass.:
471.422
SMILES:
Cc1nc(N2CCC3(Cc4ccccc4[C@@H]3N)CC2)c(C)c(=O)n1C1=CC=C[C@H](Cl)[C@@H]1Cl
: