Target
Tyrosine-protein phosphatase non-receptor type 11
Ligand
BDBM497092
Substrate
Meas. Tech.
Biochemical Assay
IC50
120±n/a nM
Citation
 Jorand-Lebrun, CBoivin, RJohnson, TWang, YXiao, YChen, XLinde, NMusch, DKumar, D Pyrimidinone derivatives as SHP2 antagonists US Patent  US11001561 Publication Date 5/11/2021 
Target
Name:
Tyrosine-protein phosphatase non-receptor type 11
Synonyms:
PTN11_HUMAN PTP-2C PTPN11 Protein tyrosine phosphatase (PTP) Shp2 Protein-tyrosine phosphatase 2C SHP2 Src homology phosphatase 2 (SHP-2) Tyrosine-protein phosphatase non-receptor type 11 (PTPN11) Tyrosine-protein phosphatase non-receptor type 11 (SHP2)
Type:
Protein phosphatase
Mol. Mass.:
68443.59
Organism:
Homo sapiens (Human)
Description:
Q06124
Residue:
597
  
Inhibitor
Name:
BDBM497092
Synonyms:
US11001561, Compound 75
Type:
Small organic molecule
Emp. Form.:
C24H29Cl2N5O
Mol. Mass.:
474.426
SMILES:
Cc1nc(N2CCC3(CC2)[C@H](N)Cc2cccnc32)c(C)c(=O)n1[C@H]1CCCC(Cl)=C1Cl
: