Target
Membrane primary amine oxidase
Ligand
BDBM497164
Substrate
Meas. Tech.
Enzyme Activity Assay
IC50
4.60±n/a nM
Citation
 Luo, ZLi, XYang, YYang, LLi, PHe, HLi, JChen, S SSAO inhibitor US Patent  US11001563 Publication Date 5/11/2021 
Target
Name:
Membrane primary amine oxidase
Synonyms:
AOC3 Amine oxidase, copper containing Semicarbazide-sensitive amine oxidase/ Vascular adhesion protein 1 (SSAO/VAP-1) Vascular adhesion protein 1 (VAP-1)
Type:
Protein
Mol. Mass.:
84620.86
Organism:
Homo sapiens (Human)
Description:
Q16853
Residue:
763
  
Inhibitor
Name:
BDBM497164
Synonyms:
US11001563, Compound WX036
Type:
Small organic molecule
Emp. Form.:
C13H12F4N4O
Mol. Mass.:
316.2542
SMILES:
NC\C(COc1ccc(cc1)-c1nc(n[nH]1)C(F)(F)F)=C\F
: