Target
Membrane primary amine oxidase
Ligand
BDBM497189
Substrate
Meas. Tech.
Enzyme Activity Assay
IC50
0.400±n/a nM
Citation
 Luo, ZLi, XYang, YYang, LLi, PHe, HLi, JChen, S SSAO inhibitor US Patent  US11001563 Publication Date 5/11/2021 
Target
Name:
Membrane primary amine oxidase
Synonyms:
AOC3 Amine oxidase, copper containing Semicarbazide-sensitive amine oxidase/ Vascular adhesion protein 1 (SSAO/VAP-1) Vascular adhesion protein 1 (VAP-1)
Type:
Protein
Mol. Mass.:
84620.86
Organism:
Homo sapiens (Human)
Description:
Q16853
Residue:
763
  
Inhibitor
Name:
BDBM497189
Synonyms:
US11001563, Compound WX083
Type:
Small organic molecule
Emp. Form.:
C15H17ClFN3O3
Mol. Mass.:
341.765
SMILES:
NC\C(COc1ccc(cc1)-c1nc(no1)C(CO)CCl)=C\F
: