Target
Lysine-specific demethylase 4C
Ligand
BDBM270499
Substrate
Meas. Tech.
In Vitro Enzyme Inhibition Assay
IC50
550±n/a nM
Citation
 Chen, YKWallace, MB Histone demethylase inhibitors US Patent  US11001568 Publication Date 5/11/2021 
Target
Name:
Lysine-specific demethylase 4C
Synonyms:
GASC-1 protein Gene amplified in squamous cell carcinoma 1 protein JMJD2C Jumonji domain-containing protein 2C KDM4C_HUMAN | KIAA0780
Type:
Protein
Mol. Mass.:
119979.01
Organism:
Homo sapiens (Human)
Description:
Q9H3R0
Residue:
1056
  
Inhibitor
Name:
BDBM270499
Synonyms:
3-{[((1R)-6-{methyl[4-(methylethyl)phenyl]amino}-1,2,3,4-tetrahydroisoquinolyl)methyl]amino}pyridine-4-carboxylic acid US11001568, Example 3B | US11731954, Example 3B
Type:
Small organic molecule
Emp. Form.:
C26H30N4O2
Mol. Mass.:
430.542
SMILES:
CC(C)c1ccc(cc1)N(C)c1ccc2[C@H](CNc3cnccc3C(O)=O)NCCc2c1
: