Target
Lysine-specific demethylase 6B
Ligand
BDBM270494
Substrate
Meas. Tech.
In Vitro Enzyme Inhibition Assay
IC50
550±n/a nM
Citation
 Chen, YKWallace, MB Histone demethylase inhibitors US Patent  US11001568 Publication Date 5/11/2021 
Target
Name:
Lysine-specific demethylase 6B
Synonyms:
JMJD3 Jumonji domain-containing protein 3 KDM6B_HUMAN Lysine demethylase 6B Lysine-specific demethylase 6B (KDM6B(JMJD3)) | Lysine-specific demethylase 6B (KDM6B)
Type:
Protein
Mol. Mass.:
176672.55
Organism:
Homo sapiens (Human)
Description:
O15054
Residue:
1643
  
Inhibitor
Name:
BDBM270494
Synonyms:
3-[({(1S)-6-[methyl(4-methylphenyl)amino]-1,2,3,4-tetra-hydroisoquinolyl}methyl)amino]pyridine-4-carboxylic acid US11001568, Example 1A | US11731954, Example 1A
Type:
Small organic molecule
Emp. Form.:
C24H26N4O2
Mol. Mass.:
402.4888
SMILES:
CN(c1ccc(C)cc1)c1ccc2[C@@H](CNc3cnccc3C(O)=O)NCCc2c1
: