Target
Lysine-specific demethylase 6B
Ligand
BDBM270509
Substrate
Meas. Tech.
In Vitro Enzyme Inhibition Assay
IC50
5500±n/a nM
Citation
 Chen, YKWallace, MB Histone demethylase inhibitors US Patent  US11001568 Publication Date 5/11/2021 
Target
Name:
Lysine-specific demethylase 6B
Synonyms:
JMJD3 Jumonji domain-containing protein 3 KDM6B_HUMAN Lysine demethylase 6B Lysine-specific demethylase 6B (KDM6B(JMJD3)) | Lysine-specific demethylase 6B (KDM6B)
Type:
Protein
Mol. Mass.:
176672.55
Organism:
Homo sapiens (Human)
Description:
O15054
Residue:
1643
  
Inhibitor
Name:
BDBM270509
Synonyms:
(S)-3-(((6-(o-tolyl)-1,2,3,4-tetrahydroisoquinolin-1-yl)methyl)amino)isonicotinic acid US11001568, Example 8B
Type:
Small organic molecule
Emp. Form.:
C23H23N3O2
Mol. Mass.:
373.4476
SMILES:
Cc1ccccc1-c1ccc2[C@@H](CNc3cnccc3C(O)=O)NCCc2c1
: