Target
Lysine-specific demethylase 4C
Ligand
BDBM270521
Substrate
Meas. Tech.
In Vitro Enzyme Inhibition Assay
IC50
5500±n/a nM
Citation
 Chen, YKWallace, MB Histone demethylase inhibitors US Patent  US11001568 Publication Date 5/11/2021 
Target
Name:
Lysine-specific demethylase 4C
Synonyms:
GASC-1 protein Gene amplified in squamous cell carcinoma 1 protein JMJD2C Jumonji domain-containing protein 2C KDM4C_HUMAN | KIAA0780
Type:
Protein
Mol. Mass.:
119979.01
Organism:
Homo sapiens (Human)
Description:
Q9H3R0
Residue:
1056
  
Inhibitor
Name:
BDBM270521
Synonyms:
(S)-3-(((2-methyl-6-(methyl(4-propylphenyl)amino)-1,2,3,4-tetrahydroisoquinolin-1-yl)methyl)amino)isonicotinic acid US11001568, Example 14B
Type:
Small organic molecule
Emp. Form.:
C27H32N4O2
Mol. Mass.:
444.5686
SMILES:
CCCc1ccc(cc1)N(C)c1ccc2[C@@H](CNc3cnccc3C(O)=O)N(C)CCc2c1
: