Target
Lysine-specific demethylase 6B
Ligand
BDBM270522
Substrate
Meas. Tech.
In Vitro Enzyme Inhibition Assay
IC50
5500±n/a nM
Citation
 Chen, YKWallace, MB Histone demethylase inhibitors US Patent  US11001568 Publication Date 5/11/2021 
Target
Name:
Lysine-specific demethylase 6B
Synonyms:
JMJD3 Jumonji domain-containing protein 3 KDM6B_HUMAN Lysine demethylase 6B Lysine-specific demethylase 6B (KDM6B(JMJD3)) | Lysine-specific demethylase 6B (KDM6B)
Type:
Protein
Mol. Mass.:
176672.55
Organism:
Homo sapiens (Human)
Description:
O15054
Residue:
1643
  
Inhibitor
Name:
BDBM270522
Synonyms:
(R)-3-(((6-(2-ethylphenyl)-2-methyl-1,2,3,4-tetrahydro-isoquinolin-1-yl)methyl)amino)isonicotinic acid US11001568, Example 15A | US11731954, Example 15A and 15B
Type:
Small organic molecule
Emp. Form.:
C25H27N3O2
Mol. Mass.:
401.5008
SMILES:
CCc1ccccc1-c1ccc2[C@H](CNc3cnccc3C(O)=O)N(C)CCc2c1
: