Target
Lysine-specific demethylase 4C
Ligand
BDBM270526
Substrate
Meas. Tech.
In Vitro Enzyme Inhibition Assay
IC50
5500±n/a nM
Citation
 Chen, YKWallace, MB Histone demethylase inhibitors US Patent  US11001568 Publication Date 5/11/2021 
Target
Name:
Lysine-specific demethylase 4C
Synonyms:
GASC-1 protein Gene amplified in squamous cell carcinoma 1 protein JMJD2C Jumonji domain-containing protein 2C KDM4C_HUMAN | KIAA0780
Type:
Protein
Mol. Mass.:
119979.01
Organism:
Homo sapiens (Human)
Description:
Q9H3R0
Residue:
1056
  
Inhibitor
Name:
BDBM270526
Synonyms:
(R)-3-(((6-(2,6-dimethylphenyl)-2-methyl-1,2,3,4-tetra-hydroisoquinolin-1-yl)methyl)amino)isonicotinic acid US11001568, Example 17A | US11731954, Example 17A and 17B
Type:
Small organic molecule
Emp. Form.:
C25H27N3O2
Mol. Mass.:
401.5008
SMILES:
CN1CCc2cc(ccc2[C@@H]1CNc1cnccc1C(O)=O)-c1c(C)cccc1C
: