Target
Lysine-specific demethylase 6B
Ligand
BDBM270533
Substrate
Meas. Tech.
In Vitro Enzyme Inhibition Assay
IC50
5500±n/a nM
Citation
 Chen, YKWallace, MB Histone demethylase inhibitors US Patent  US11001568 Publication Date 5/11/2021 
Target
Name:
Lysine-specific demethylase 6B
Synonyms:
JMJD3 Jumonji domain-containing protein 3 KDM6B_HUMAN Lysine demethylase 6B Lysine-specific demethylase 6B (KDM6B(JMJD3)) | Lysine-specific demethylase 6B (KDM6B)
Type:
Protein
Mol. Mass.:
176672.55
Organism:
Homo sapiens (Human)
Description:
O15054
Residue:
1643
  
Inhibitor
Name:
BDBM270533
Synonyms:
(S)-3-(((2-methyl-5-(methyl(4-propylphenyl)amino)isoindolin-1-yl)methyl)amino)isonicotinic acid US11001568, Example 20B
Type:
Small organic molecule
Emp. Form.:
C26H30N4O2
Mol. Mass.:
430.542
SMILES:
CCCc1ccc(cc1)N(C)c1ccc2[C@@H](CNc3cnccc3C(O)=O)N(C)Cc2c1
: