Target
Fibroblast growth factor receptor 1
Ligand
BDBM443220
Substrate
Meas. Tech.
Determination of the Effect of the Compounds of the Present Invention Against FGFR Kinase Activity
IC50
160±n/a nM
Citation
 Chen, LGuan, DBai, HGou, JZhao, WWang, ZLing, LMa, Y Pyrimidine derivative, method for preparing same and use thereof in medicine US Patent  US11001572 Publication Date 5/11/2021 
Target
Name:
Fibroblast growth factor receptor 1
Synonyms:
BFGFR Basic fibroblast growth factor receptor 1 (FGFR1) CEK FGFR-1 FGFR-1, (FL) FGFR1_HUMAN FLT2 Fibroblast growth factor receptor 1 (FGFR-1) Fms-like tyrosine kinase 2 N-sam bFGF-R | c-fgr
Type:
Receptor
Mol. Mass.:
91861.70
Organism:
Homo sapiens (Human)
Description:
P11362
Residue:
822
  
Inhibitor
Name:
BDBM443220
Synonyms:
N-(2-((6-(3-(2,6-Dichloro-3,5-dimethoxyphenyl)-1-methylureido)pyrimidin-4-yl)amino)-5-(2,7-diazaspiro[3.5]nonan-2-yl)phenyl)acrylamide US11001572, Example 1
Type:
Small organic molecule
Emp. Form.:
C30H34Cl2N8O4
Mol. Mass.:
641.548
SMILES:
COc1cc(OC)c(Cl)c(NC(=O)N(C)c2cc(Nc3ccc(cc3NC(=O)C=C)N3CC4(C3)CCNCC4)ncn2)c1Cl
: