Target
Fibroblast growth factor receptor 2
Ligand
BDBM443223
Substrate
Meas. Tech.
Determination of the Effect of the Compounds of the Present Invention Against FGFR Kinase Activity
IC50
165±n/a nM
Citation
 Chen, LGuan, DBai, HGou, JZhao, WWang, ZLing, LMa, Y Pyrimidine derivative, method for preparing same and use thereof in medicine US Patent  US11001572 Publication Date 5/11/2021 
Target
Name:
Fibroblast growth factor receptor 2
Synonyms:
BEK FGFR-2 FGFR2 Fibroblast growth factor receptor 2 (FGFR2) KGFR Keratinocyte growth factor receptor VEGF-receptor 2 and Fibroblast growth factor receptor 2
Type:
Enzyme
Mol. Mass.:
92015.45
Organism:
Homo sapiens (Human)
Description:
P21802
Residue:
821
  
Inhibitor
Name:
BDBM443223
Synonyms:
N-(2-((6-(3-(2,6-Dichloro-3,5-dimethoxyphenyl)-1-methylureido)pyrimidin-4-yl)amino)-5-(7-ethyl-2,7-diazaspiro[3.5]nonan-2-yl)phenyl)acrylamide US11001572, Example 4
Type:
Small organic molecule
Emp. Form.:
C32H38Cl2N8O4
Mol. Mass.:
669.601
SMILES:
CCN1CCC2(CN(C2)c2ccc(Nc3cc(ncn3)N(C)C(=O)Nc3c(Cl)c(OC)cc(OC)c3Cl)c(NC(=O)C=C)c2)CC1
: