Target
Fibroblast growth factor receptor 2
Ligand
BDBM443224
Substrate
Meas. Tech.
Determination of the Effect of the Compounds of the Present Invention Against FGFR Kinase Activity
IC50
533±n/a nM
Citation
 Chen, LGuan, DBai, HGou, JZhao, WWang, ZLing, LMa, Y Pyrimidine derivative, method for preparing same and use thereof in medicine US Patent  US11001572 Publication Date 5/11/2021 
Target
Name:
Fibroblast growth factor receptor 2
Synonyms:
BEK FGFR-2 FGFR2 Fibroblast growth factor receptor 2 (FGFR2) KGFR Keratinocyte growth factor receptor VEGF-receptor 2 and Fibroblast growth factor receptor 2
Type:
Enzyme
Mol. Mass.:
92015.45
Organism:
Homo sapiens (Human)
Description:
P21802
Residue:
821
  
Inhibitor
Name:
BDBM443224
Synonyms:
N-(2-((6-(3-(2,6-Dichloro-3,5-dimethoxyphenyl)-1-methylureido)pyrimidin-4-yl)amino)-5-(4-ethyl-4,7-diazaspiro[2.5]octan-7-yl)phenyl)acrylamide US11001572, Example 5
Type:
Small organic molecule
Emp. Form.:
C31H36Cl2N8O4
Mol. Mass.:
655.575
SMILES:
CCN1CCN(CC11CC1)c1ccc(Nc2cc(ncn2)N(C)C(=O)Nc2c(Cl)c(OC)cc(OC)c2Cl)c(NC(=O)C=C)c1
: