Target
Fibroblast growth factor receptor 2
Ligand
BDBM443227
Substrate
Meas. Tech.
Determination of the Effect of the Compounds of the Present Invention Against FGFR Kinase Activity
IC50
644±n/a nM
Citation
 Chen, LGuan, DBai, HGou, JZhao, WWang, ZLing, LMa, Y Pyrimidine derivative, method for preparing same and use thereof in medicine US Patent  US11001572 Publication Date 5/11/2021 
Target
Name:
Fibroblast growth factor receptor 2
Synonyms:
BEK FGFR-2 FGFR2 Fibroblast growth factor receptor 2 (FGFR2) KGFR Keratinocyte growth factor receptor VEGF-receptor 2 and Fibroblast growth factor receptor 2
Type:
Enzyme
Mol. Mass.:
92015.45
Organism:
Homo sapiens (Human)
Description:
P21802
Residue:
821
  
Inhibitor
Name:
BDBM443227
Synonyms:
N-(5-(4-Cyclopropylpiperazin-1-yl)-2-((6-(3-(2,6-dichloro-3,5-dimethoxyphenyl)-1-methylureido)pyrimidin-4-yl)amino)phenyl) acrylamide US11001572, Example 8
Type:
Small organic molecule
Emp. Form.:
C30H34Cl2N8O4
Mol. Mass.:
641.548
SMILES:
COc1cc(OC)c(Cl)c(NC(=O)N(C)c2cc(Nc3ccc(cc3NC(=O)C=C)N3CCN(CC3)C3CC3)ncn2)c1Cl
: