Target
Mitogen-activated protein kinase 1
Ligand
BDBM497778
Substrate
Meas. Tech.
ERK2 In vitro Inhibition Assay
IC50
1.90±n/a nM
Citation
 Berdini, VBuck, IMDay, JEGriffiths-Jones, CMHeightman, TDHoward, SMurray, CWNorton, DO''Reilly, MWoolford, AJCooke, MLCousin, DOnions, STShannon, JMWatts, JP Benzolactam compounds as protein kinase inhibitors US Patent  US11001575 Publication Date 5/11/2021 
Target
Name:
Mitogen-activated protein kinase 1
Synonyms:
ERK2 Extracellular signal-regulated kinase 2 Extracellular signal-regulated kinase 2 (ERK2) MAPK 2 MK01_HUMAN Mitogen-activated protein kinase 1 (ERK-2) Mitogen-activated protein kinase 2 PRKM2 | p42-MAPK
Type:
Ser/Thr Protein Kinase
Mol. Mass.:
41392.76
Organism:
Homo sapiens (Human)
Description:
P28482
Residue:
360
  
Inhibitor
Name:
BDBM497778
Synonyms:
US11001575, Example 596
Type:
Small organic molecule
Emp. Form.:
C29H32ClN5O4
Mol. Mass.:
550.048
SMILES:
CC[C@H](O)[C@@H](NC(=O)CN1Cc2ccc(cc2C1=O)-c1nc(NC2CCOCC2)ncc1Cl)c1ccccc1
: