Target
Mitogen-activated protein kinase 1
Ligand
BDBM418133
Substrate
Meas. Tech.
ERK2 In vitro Inhibition Assay
IC50
1.60±n/a nM
Citation
 Berdini, VBuck, IMDay, JEGriffiths-Jones, CMHeightman, TDHoward, SMurray, CWNorton, DO''Reilly, MWoolford, AJCooke, MLCousin, DOnions, STShannon, JMWatts, JP Benzolactam compounds as protein kinase inhibitors US Patent  US11001575 Publication Date 5/11/2021 
Target
Name:
Mitogen-activated protein kinase 1
Synonyms:
ERK2 Extracellular signal-regulated kinase 2 Extracellular signal-regulated kinase 2 (ERK2) MAPK 2 MK01_HUMAN Mitogen-activated protein kinase 1 (ERK-2) Mitogen-activated protein kinase 2 PRKM2 | p42-MAPK
Type:
Ser/Thr Protein Kinase
Mol. Mass.:
41392.76
Organism:
Homo sapiens (Human)
Description:
P28482
Residue:
360
  
Inhibitor
Name:
BDBM418133
Synonyms:
(2R)-2-(6-{5-chloro-2-[(oxan-4- yl)amino]pyrimidin-4-yl}-1-oxo-2,3- dihydro-1H-isoindol-2-yl)-N-[(1S)-2- hydroxy-1-(5-methylthiophen-3- yl)ethyl]propanamide US11001575, Example 872
Type:
Small organic molecule
Emp. Form.:
C27H30ClN5O4S
Mol. Mass.:
556.076
SMILES:
C[C@@H](N1Cc2ccc(cc2C1=O)-c1nc(NC2CCOCC2)ncc1Cl)C(=O)N[C@H](CO)c1csc(C)c1
: