Target
Kallikrein-1
Ligand
BDBM408668
Substrate
Meas. Tech.
Inhibitory Activity Assay
IC50
>10000±n/a nM
Citation
 Davie, RLEdwards, HJEvans, DMHodgson, ST N-((HET)arylmethyl)-heteroaryl-carboxamides compounds as plasma kallikrein inhibitors US Patent  US11001578 Publication Date 5/11/2021 
Target
Name:
Kallikrein-1
Synonyms:
KLK1 Kallikrein 1 Kidney/pancreas/salivary gland kallikrein | Tissue kallikrein
Type:
Enzyme
Mol. Mass.:
28874.69
Organism:
Homo sapiens (Human)
Description:
P06870
Residue:
262
  
Inhibitor
Name:
BDBM408668
Synonyms:
N-[(2-fluoro-3-methoxyphenyl)methyl]-1-({4-[(4-methylpyrazol-1- yl)methyl]phenyl}methyl)-3-(trifluoromethyl)pyrazole-4-carboxamide US11001578, Example 4 US11198691, Example 4
Type:
Small organic molecule
Emp. Form.:
C25H23F4N5O2
Mol. Mass.:
501.476
SMILES:
COc1cccc(CNC(=O)c2cn(Cc3ccc(Cn4cc(C)cn4)cc3)nc2C(F)(F)F)c1F
: