Target
Plasma kallikrein
Ligand
BDBM497240
Substrate
Meas. Tech.
Inhibitory Activity Assay
IC50
439±n/a nM
Citation
 Davie, RLEdwards, HJEvans, DMHodgson, ST N-((HET)arylmethyl)-heteroaryl-carboxamides compounds as plasma kallikrein inhibitors US Patent  US11001578 Publication Date 5/11/2021 
Target
Name:
Plasma kallikrein
Synonyms:
Fletcher factor KLKB1 Kallikrein Plasma kallikrein heavy chain Plasma prekallikrein
Type:
Protein
Mol. Mass.:
71391.16
Organism:
Homo sapiens (Human)
Description:
P03952
Residue:
638
  
Inhibitor
Name:
BDBM497240
Synonyms:
N-[(2,6-difluorophenyl)methyl]-1-({4-[(4-methylpyrazol-1-yl)methyl]phenyl}methyl)- | US11001578, Example 13
Type:
Small organic molecule
Emp. Form.:
C24H21F4N5O
Mol. Mass.:
471.4501
SMILES:
Cc1cnn(Cc2ccc(Cn3cc(C(=O)NCc4ccccc4F)c(n3)C(F)(F)F)cc2)c1
: