Target
Plasma kallikrein
Ligand
BDBM408691
Substrate
Meas. Tech.
Inhibitory Activity Assay
IC50
219±n/a nM
Citation
 Davie, RLEdwards, HJEvans, DMHodgson, ST N-((HET)arylmethyl)-heteroaryl-carboxamides compounds as plasma kallikrein inhibitors US Patent  US11001578 Publication Date 5/11/2021 
Target
Name:
Plasma kallikrein
Synonyms:
Fletcher factor KLKB1 Kallikrein Plasma kallikrein heavy chain Plasma prekallikrein
Type:
Protein
Mol. Mass.:
71391.16
Organism:
Homo sapiens (Human)
Description:
P03952
Residue:
638
  
Inhibitor
Name:
BDBM408691
Synonyms:
N-{[2-fluoro-6-(trifluoromethyl)phenyl]methyl}-1-({4-[(4-methylpyrazol-1- yl)methyl]phenyl}methyl)-3-(trifluoromethyl)pyrazole-4-carboxamide US11001578, Example 15 US11198691, Example 15
Type:
Small organic molecule
Emp. Form.:
C25H20F7N5O
Mol. Mass.:
539.448
SMILES:
Cc1cnn(Cc2ccc(Cn3cc(C(=O)NCc4c(F)cccc4C(F)(F)F)c(n3)C(F)(F)F)cc2)c1
: