Target
Kallikrein-1
Ligand
BDBM408695
Substrate
Meas. Tech.
Inhibitory Activity Assay
IC50
>10000±n/a nM
Citation
 Davie, RLEdwards, HJEvans, DMHodgson, ST N-((HET)arylmethyl)-heteroaryl-carboxamides compounds as plasma kallikrein inhibitors US Patent  US11001578 Publication Date 5/11/2021 
Target
Name:
Kallikrein-1
Synonyms:
KLK1 Kallikrein 1 Kidney/pancreas/salivary gland kallikrein | Tissue kallikrein
Type:
Enzyme
Mol. Mass.:
28874.69
Organism:
Homo sapiens (Human)
Description:
P06870
Residue:
262
  
Inhibitor
Name:
BDBM408695
Synonyms:
N-[(3-chloro-2-fluorophenyl)methyl]-1-({4-[(4-methylpyrazol-1- yl)methyl]phenyl}methyl)-3-(trifluoromethyl)pyrazole-4-carboxamide US11001578, Example 19 US11198691, Example 19
Type:
Small organic molecule
Emp. Form.:
C24H20ClF4N5O
Mol. Mass.:
505.895
SMILES:
Cc1cnn(Cc2ccc(Cn3cc(C(=O)NCc4cccc(Cl)c4F)c(n3)C(F)(F)F)cc2)c1
: