Target
Kallikrein-1
Ligand
BDBM497257
Substrate
Meas. Tech.
Inhibitory Activity Assay
IC50
>10000±n/a nM
Citation
 Davie, RLEdwards, HJEvans, DMHodgson, ST N-((HET)arylmethyl)-heteroaryl-carboxamides compounds as plasma kallikrein inhibitors US Patent  US11001578 Publication Date 5/11/2021 
Target
Name:
Kallikrein-1
Synonyms:
KLK1 Kallikrein 1 Kidney/pancreas/salivary gland kallikrein | Tissue kallikrein
Type:
Enzyme
Mol. Mass.:
28874.69
Organism:
Homo sapiens (Human)
Description:
P06870
Residue:
262
  
Inhibitor
Name:
BDBM497257
Synonyms:
N-[(4-chloropyridin-2-yl)methyl]-1-({4-[(4-methylpyrazol-1-yl)methyl]phenyl}methyl)- US11084809, Example 30 | US11198691, Example 30
Type:
Small organic molecule
Emp. Form.:
C23H20ClF3N6O
Mol. Mass.:
488.893
SMILES:
Cc1cnn(Cc2ccc(Cn3cc(C(=O)NCc4cc(Cl)ccn4)c(n3)C(F)(F)F)cc2)c1
: