Target
Kallikrein-1
Ligand
BDBM408712
Substrate
Meas. Tech.
Inhibitory Activity Assay
IC50
>10000±n/a nM
Citation
 Davie, RLEdwards, HJEvans, DMHodgson, ST N-((HET)arylmethyl)-heteroaryl-carboxamides compounds as plasma kallikrein inhibitors US Patent  US11001578 Publication Date 5/11/2021 
Target
Name:
Kallikrein-1
Synonyms:
KLK1 Kallikrein 1 Kidney/pancreas/salivary gland kallikrein | Tissue kallikrein
Type:
Enzyme
Mol. Mass.:
28874.69
Organism:
Homo sapiens (Human)
Description:
P06870
Residue:
262
  
Inhibitor
Name:
BDBM408712
Synonyms:
3-(methoxymethyl)-N-[(6-methylpyridin-3-yl)methyl]-1-({4-[(2-oxopyridin-1- yl)methyl]phenyl}methyl)pyrazole-4-carboxamide US10364238, Example 39 US11084809, Example 39 | US11198691, Example 39
Type:
Small organic molecule
Emp. Form.:
C26H27N5O3
Mol. Mass.:
457.5243
SMILES:
COCc1nn(Cc2ccc(Cn3ccccc3=O)cc2)cc1C(=O)NCc1ccc(C)nc1
: