Target
Plasma kallikrein
Ligand
BDBM408711
Substrate
Meas. Tech.
Inhibitory Activity Assay
IC50
392±n/a nM
Citation
 Davie, RLEdwards, HJEvans, DMHodgson, ST N-((HET)arylmethyl)-heteroaryl-carboxamides compounds as plasma kallikrein inhibitors US Patent  US11001578 Publication Date 5/11/2021 
Target
Name:
Plasma kallikrein
Synonyms:
Fletcher factor KLKB1 Kallikrein Plasma kallikrein heavy chain Plasma prekallikrein
Type:
Protein
Mol. Mass.:
71391.16
Organism:
Homo sapiens (Human)
Description:
P03952
Residue:
638
  
Inhibitor
Name:
BDBM408711
Synonyms:
3-(methoxymethyl)-1-({4-[(2-oxopyridin-1-yl)methyl]phenyl}methyl)-N-{[4- (trifluoromethyl)pyridin-3-yl]methyl}pyrazole-4-carboxamide US10364238, Example 37 US11084809, Example 37 | US11198691, Example 37
Type:
Small organic molecule
Emp. Form.:
C26H24F3N5O3
Mol. Mass.:
511.4957
SMILES:
COCc1nn(Cc2ccc(Cn3ccccc3=O)cc2)cc1C(=O)NCc1cnccc1C(F)(F)F
: