Target
Plasma kallikrein
Ligand
BDBM408732
Substrate
Meas. Tech.
Inhibitory Activity Assay
IC50
48.9±n/a nM
Citation
 Davie, RLEdwards, HJEvans, DMHodgson, ST N-((HET)arylmethyl)-heteroaryl-carboxamides compounds as plasma kallikrein inhibitors US Patent  US11001578 Publication Date 5/11/2021 
Target
Name:
Plasma kallikrein
Synonyms:
Fletcher factor KLKB1 Kallikrein Plasma kallikrein heavy chain Plasma prekallikrein
Type:
Protein
Mol. Mass.:
71391.16
Organism:
Homo sapiens (Human)
Description:
P03952
Residue:
638
  
Inhibitor
Name:
BDBM408732
Synonyms:
N-{[2-fluoro-6-(trifluoromethyl)phenyl]methyl}-1-({4-[(2-oxopyridin-1- yl)methyl]phenyl}methyl)-3-(trifluoromethyl)pyrazole-4-carboxamide US11001578, Example 51 US11198691, Example 51
Type:
Small organic molecule
Emp. Form.:
C26H19F7N4O2
Mol. Mass.:
552.4435
SMILES:
Fc1cccc(c1CNC(=O)c1cn(Cc2ccc(Cn3ccccc3=O)cc2)nc1C(F)(F)F)C(F)(F)F
: