Target
Plasma kallikrein
Ligand
BDBM408738
Substrate
Meas. Tech.
Inhibitory Activity Assay
IC50
73.4±n/a nM
Citation
 Davie, RLEdwards, HJEvans, DMHodgson, ST N-((HET)arylmethyl)-heteroaryl-carboxamides compounds as plasma kallikrein inhibitors US Patent  US11001578 Publication Date 5/11/2021 
Target
Name:
Plasma kallikrein
Synonyms:
Fletcher factor KLKB1 Kallikrein Plasma kallikrein heavy chain Plasma prekallikrein
Type:
Protein
Mol. Mass.:
71391.16
Organism:
Homo sapiens (Human)
Description:
P03952
Residue:
638
  
Inhibitor
Name:
BDBM408738
Synonyms:
3-(dimethylamino)-N-[(2-fluoro-3-methoxyphenyl)methyl]-1-({4-[(2-oxopyridin-1- yl)methyl]phenyl}methyl)pyrazole-4-carboxamide US11001578, Example 59 US11198691, Example 59
Type:
Small organic molecule
Emp. Form.:
C27H28FN5O3
Mol. Mass.:
489.5413
SMILES:
COc1cccc(CNC(=O)c2cn(Cc3ccc(Cn4ccccc4=O)cc3)nc2N(C)C)c1F
: