Target
Kallikrein-1
Ligand
BDBM408747
Substrate
Meas. Tech.
Inhibitory Activity Assay
IC50
>10000±n/a nM
Citation
 Davie, RLEdwards, HJEvans, DMHodgson, ST N-((HET)arylmethyl)-heteroaryl-carboxamides compounds as plasma kallikrein inhibitors US Patent  US11001578 Publication Date 5/11/2021 
Target
Name:
Kallikrein-1
Synonyms:
KLK1 Kallikrein 1 Kidney/pancreas/salivary gland kallikrein | Tissue kallikrein
Type:
Enzyme
Mol. Mass.:
28874.69
Organism:
Homo sapiens (Human)
Description:
P06870
Residue:
262
  
Inhibitor
Name:
BDBM408747
Synonyms:
N-[(3-chloro-5-methoxyphenyl)methyl]-3-(methoxymethyl)-1-({4-[(2-oxopyridin-1- yl)methyl]phenyl}methyl)pyrazole-4-carboxamide US11001578, Example 67 US11198691, Example 67
Type:
Small organic molecule
Emp. Form.:
C27H27ClN4O4
Mol. Mass.:
506.981
SMILES:
COCc1nn(Cc2ccc(Cn3ccccc3=O)cc2)cc1C(=O)NCc1cc(Cl)cc(OC)c1
: