Target
Plasma kallikrein
Ligand
BDBM408768
Substrate
Meas. Tech.
Inhibitory Activity Assay
IC50
0.600±n/a nM
Citation
 Davie, RLEdwards, HJEvans, DMHodgson, ST N-((HET)arylmethyl)-heteroaryl-carboxamides compounds as plasma kallikrein inhibitors US Patent  US11001578 Publication Date 5/11/2021 
Target
Name:
Plasma kallikrein
Synonyms:
Fletcher factor KLKB1 Kallikrein Plasma kallikrein heavy chain Plasma prekallikrein
Type:
Protein
Mol. Mass.:
71391.16
Organism:
Homo sapiens (Human)
Description:
P03952
Residue:
638
  
Inhibitor
Name:
BDBM408768
Synonyms:
N-[(6-cyano-2-fluoro-3-methoxyphenyl)methyl]-3-(methoxymethyl)-1-({4-[(2- US10730874, Example 00398 US11084809, Example 77 US11352356, Table II.4
Type:
Small organic molecule
Emp. Form.:
C28H26FN5O4
Mol. Mass.:
515.5355
SMILES:
COCc1nn(Cc2ccc(Cn3ccccc3=O)cc2)cc1C(=O)NCc1c(F)c(OC)ccc1C#N
: