Target
Plasma kallikrein
Ligand
BDBM408772
Substrate
Meas. Tech.
Inhibitory Activity Assay
IC50
20.4±n/a nM
Citation
 Davie, RLEdwards, HJEvans, DMHodgson, ST N-((HET)arylmethyl)-heteroaryl-carboxamides compounds as plasma kallikrein inhibitors US Patent  US11001578 Publication Date 5/11/2021 
Target
Name:
Plasma kallikrein
Synonyms:
Fletcher factor KLKB1 Kallikrein Plasma kallikrein heavy chain Plasma prekallikrein
Type:
Protein
Mol. Mass.:
71391.16
Organism:
Homo sapiens (Human)
Description:
P03952
Residue:
638
  
Inhibitor
Name:
BDBM408772
Synonyms:
N-{[2-(difluoromethyl)-6-fluorophenyl]methyl}-3-(methoxymethyl)-1-({4-[(2- oxopyridin-1-yl)methyl]phenyl}methyl)pyrazole-4-carboxamide US11001578, Example 80 US11198691, Example 80
Type:
Small organic molecule
Emp. Form.:
C27H25F3N4O3
Mol. Mass.:
510.5076
SMILES:
COCc1nn(Cc2ccc(Cn3ccccc3=O)cc2)cc1C(=O)NCc1c(F)cccc1C(F)F
: