Target
Plasma kallikrein
Ligand
BDBM408804
Substrate
Meas. Tech.
Inhibitory Activity Assay
IC50
742±n/a nM
Citation
 Davie, RLEdwards, HJEvans, DMHodgson, ST N-((HET)arylmethyl)-heteroaryl-carboxamides compounds as plasma kallikrein inhibitors US Patent  US11001578 Publication Date 5/11/2021 
Target
Name:
Plasma kallikrein
Synonyms:
Fletcher factor KLKB1 Kallikrein Plasma kallikrein heavy chain Plasma prekallikrein
Type:
Protein
Mol. Mass.:
71391.16
Organism:
Homo sapiens (Human)
Description:
P03952
Residue:
638
  
Inhibitor
Name:
BDBM408804
Synonyms:
N-[(2-fluoro-3-methoxyphenyl)methyl]-1-{[6-(pyrrolidin-1-yl)pyridin-3-yl]methyl}-3- (trifluoromethyl)pyrazole-4-carboxamide US11001578, Example 126 US11180484, Reference Example G
Type:
Small organic molecule
Emp. Form.:
C23H23F4N5O2
Mol. Mass.:
477.4546
SMILES:
COc1cccc(CNC(=O)c2cn(Cc3ccc(nc3)N3CCCC3)nc2C(F)(F)F)c1F
: