Target
Nuclear receptor ROR-gamma
Ligand
BDBM329654
Substrate
Meas. Tech.
Binding Assay
Ki
<100±n/a nM
Citation
 Claremon, DADillard, LWDong, CFan, YLotesta, SDMarcus, ASingh, SBTice, CMYuan, JZhao, WZhuang, L Dihydropyrrolopyridine inhibitors of ROR-gamma US Patent  US11001583 Publication Date 5/11/2021 
Target
Name:
Nuclear receptor ROR-gamma
Synonyms:
NR1F3 Nuclear receptor ROR-gamma (RORC) RAR-related orphan receptor C (RORc) RORG RZRG Retinoid-related orphan receptor-gamma (RORc)
Type:
Enzyme Catalytic Domain
Mol. Mass.:
58218.40
Organism:
Homo sapiens (Human)
Description:
P51449
Residue:
518
  
Inhibitor
Name:
BDBM329654
Synonyms:
US11001583, Compound 10 | US9663515, Compound 10
Type:
Small organic molecule
Emp. Form.:
C29H38F3N5O5S
Mol. Mass.:
625.703
SMILES:
CCS(=O)(=O)c1ccc(nc1)[C@H](COC(N)=O)NC(=O)c1cnc2[C@H](C(C)C)N(C[C@H]3CC[C@@H](CC3)C(F)(F)F)Cc2c1
: