Target
Tyrosine-protein kinase receptor TYRO3
Ligand
BDBM497237
Substrate
Meas. Tech.
Activity Assay
IC50
750±n/a nM
Citation
 Wang, XZheng, HZhao, JZhang, WFrye, SV Alkyl pyrrolopyrimidine analogs and methods of making and using same US Patent  US11001586 Publication Date 5/11/2021 
Target
Name:
Tyrosine-protein kinase receptor TYRO3
Synonyms:
BYK RSE TIF TYRO3_HUMAN | Tyrosine-protein kinase SKY
Type:
Protein
Mol. Mass.:
96894.13
Organism:
Homo sapiens (Human)
Description:
Q06418
Residue:
890
  
Inhibitor
Name:
BDBM497237
Synonyms:
(4-(7-((1R,4S)-4- hydroxycyclohexyl)-2- (((S)-pentan-2-yl)amino)- 7H-pyrrolo[2,3- d]pyrimidin-5-yl)piperidin- 1-yl)(tetrahydro-2H-pyran- 4-yl)methanone | US11001586, Example 10
Type:
Small organic molecule
Emp. Form.:
C28H43N5O3
Mol. Mass.:
497.6727
SMILES:
CCC[C@H](C)Nc1ncc2c(cn([C@H]3CC[C@H](O)CC3)c2n1)C1CCN(CC1)C(=O)C1CCOCC1
: