Target
Tyrosine-protein kinase receptor TYRO3
Ligand
BDBM497270
Substrate
Meas. Tech.
Activity Assay
IC50
275±n/a nM
Citation
 Wang, XZheng, HZhao, JZhang, WFrye, SV Alkyl pyrrolopyrimidine analogs and methods of making and using same US Patent  US11001586 Publication Date 5/11/2021 
Target
Name:
Tyrosine-protein kinase receptor TYRO3
Synonyms:
BYK RSE TIF TYRO3_HUMAN | Tyrosine-protein kinase SKY
Type:
Protein
Mol. Mass.:
96894.13
Organism:
Homo sapiens (Human)
Description:
Q06418
Residue:
890
  
Inhibitor
Name:
BDBM497270
Synonyms:
(4-(2-(((1S,2S)-2- ethylcyclopropyl)amino)-7- ((1R,4S)-4- hydroxycyclohexyl)-7H- pyrrolo[2,3-d]pyrimidin-5- yl)piperidin-1-yl)(pyridin- 4-yl)methanone | US11001586, Example 42
Type:
Small organic molecule
Emp. Form.:
C28H36N6O2
Mol. Mass.:
488.6244
SMILES:
CC[C@H]1C[C@@H]1Nc1ncc2c(cn([C@H]3CC[C@H](O)CC3)c2n1)C1CCN(CC1)C(=O)c1ccncc1
: