Target
Tyrosine-protein kinase receptor TYRO3
Ligand
BDBM497273
Substrate
Meas. Tech.
Activity Assay
IC50
750±n/a nM
Citation
 Wang, XZheng, HZhao, JZhang, WFrye, SV Alkyl pyrrolopyrimidine analogs and methods of making and using same US Patent  US11001586 Publication Date 5/11/2021 
Target
Name:
Tyrosine-protein kinase receptor TYRO3
Synonyms:
BYK RSE TIF TYRO3_HUMAN | Tyrosine-protein kinase SKY
Type:
Protein
Mol. Mass.:
96894.13
Organism:
Homo sapiens (Human)
Description:
Q06418
Residue:
890
  
Inhibitor
Name:
BDBM497273
Synonyms:
(1S,4R)-4-(5-(1'-methyl- [1,4'-bipiperidin]-4-yl)-2- (((S)-pentan-2-yl)amino)- 7H-pyrrolo[2,3- d]pyrimidin-7- yl)cyclohexan-1-ol | US11001586, Example 52
Type:
Small organic molecule
Emp. Form.:
C28H46N6O
Mol. Mass.:
482.7044
SMILES:
CCC[C@H](C)Nc1ncc2c(cn([C@H]3CC[C@H](O)CC3)c2n1)C1CCN(CC1)C1CCN(C)CC1
: