Target
Tyrosine-protein kinase Mer
Ligand
BDBM497290
Substrate
Meas. Tech.
Activity Assay
IC50
<3±n/a nM
Citation
 Wang, XZheng, HZhao, JZhang, WFrye, SV Alkyl pyrrolopyrimidine analogs and methods of making and using same US Patent  US11001586 Publication Date 5/11/2021 
Target
Name:
Tyrosine-protein kinase Mer
Synonyms:
MER MERTK Proto-oncogene c-Mer Receptor tyrosine kinase MerTK | Tyrosine-protein kinase Mer
Type:
PROTEIN
Mol. Mass.:
110234.77
Organism:
Homo sapiens (Human)
Description:
ChEMBL_1498723
Residue:
999
  
Inhibitor
Name:
BDBM497290
Synonyms:
(2,6-dimethylpyridin-4- yl)(4-(2-((2- ethylbutyl)amino)-7- ((1r,4r)-4- hydroxycyclohexyl)-7H- pyrrolo[2,3-d]pyrimidin-5- yl)piperidin-1- yl)methanone | US11001586, Example 69
Type:
Small organic molecule
Emp. Form.:
C31H44N6O2
Mol. Mass.:
532.7201
SMILES:
CCC(CC)CNc1ncc2c(cn([C@H]3CC[C@H](O)CC3)c2n1)C1CCN(CC1)C(=O)c1cc(C)nc(C)c1
: