Target
Tyrosine-protein kinase receptor TYRO3
Ligand
BDBM497294
Substrate
Meas. Tech.
Activity Assay
IC50
275±n/a nM
Citation
 Wang, XZheng, HZhao, JZhang, WFrye, SV Alkyl pyrrolopyrimidine analogs and methods of making and using same US Patent  US11001586 Publication Date 5/11/2021 
Target
Name:
Tyrosine-protein kinase receptor TYRO3
Synonyms:
BYK RSE TIF TYRO3_HUMAN | Tyrosine-protein kinase SKY
Type:
Protein
Mol. Mass.:
96894.13
Organism:
Homo sapiens (Human)
Description:
Q06418
Residue:
890
  
Inhibitor
Name:
BDBM497294
Synonyms:
(4-(2-(benzylamino)-7- ((1r,4r)-4- hydroxycyclohexyl)-7H- pyrrolo[2,3-d]pyrimidin-5- yl)piperidin-1-yl)(2,6- dimethylpyridin-4- yl)methanone | US11001586, Example 73
Type:
Small organic molecule
Emp. Form.:
C32H38N6O2
Mol. Mass.:
538.6831
SMILES:
Cc1cc(cc(C)n1)C(=O)N1CCC(CC1)c1cn([C@H]2CC[C@H](O)CC2)c2nc(NCc3ccccc3)ncc12
: