Target
Tyrosine-protein kinase receptor TYRO3
Ligand
BDBM497296
Substrate
Meas. Tech.
Activity Assay
IC50
750±n/a nM
Citation
 Wang, XZheng, HZhao, JZhang, WFrye, SV Alkyl pyrrolopyrimidine analogs and methods of making and using same US Patent  US11001586 Publication Date 5/11/2021 
Target
Name:
Tyrosine-protein kinase receptor TYRO3
Synonyms:
BYK RSE TIF TYRO3_HUMAN | Tyrosine-protein kinase SKY
Type:
Protein
Mol. Mass.:
96894.13
Organism:
Homo sapiens (Human)
Description:
Q06418
Residue:
890
  
Inhibitor
Name:
BDBM497296
Synonyms:
(2,6-dimethylpyridin-4- yl)(4-(2-(((S)-1-(4- fluorophenyl)ethyl)amino)- 7-((1r,4S)-4- hydroxycyclohexyl)-7H- pyrrolo[2,3-d]pyrimidin-5- yl)piperidin-1- yl)methanone | US11001586, Example 75
Type:
Small organic molecule
Emp. Form.:
C33H39FN6O2
Mol. Mass.:
570.7002
SMILES:
C[C@H](Nc1ncc2c(cn([C@H]3CC[C@H](O)CC3)c2n1)C1CCN(CC1)C(=O)c1cc(C)nc(C)c1)c1ccc(F)cc1
: