Target
Tyrosine-protein kinase Mer
Ligand
BDBM497298
Substrate
Meas. Tech.
Activity Assay
IC50
750±n/a nM
Citation
 Wang, XZheng, HZhao, JZhang, WFrye, SV Alkyl pyrrolopyrimidine analogs and methods of making and using same US Patent  US11001586 Publication Date 5/11/2021 
Target
Name:
Tyrosine-protein kinase Mer
Synonyms:
MER MERTK Proto-oncogene c-Mer Receptor tyrosine kinase MerTK | Tyrosine-protein kinase Mer
Type:
PROTEIN
Mol. Mass.:
110234.77
Organism:
Homo sapiens (Human)
Description:
ChEMBL_1498723
Residue:
999
  
Inhibitor
Name:
BDBM497298
Synonyms:
(4-(2-(((R)-2,3-dihydro-1H- inden-1-yl)amino)-7- ((1r,4R)-4- hydroxycyclohexyl)-7H- pyrrolo[2,3-d]pyrimidin-5- yl)piperidin-1-yl)(2,6- dimethylpyridin-4- yl)methanone | US11001586, Example 77
Type:
Small organic molecule
Emp. Form.:
C34H40N6O2
Mol. Mass.:
564.7204
SMILES:
Cc1cc(cc(C)n1)C(=O)N1CCC(CC1)c1cn([C@H]2CC[C@H](O)CC2)c2nc(N[C@@H]3CCc4ccccc34)ncc12
: