Target
Tyrosine-protein kinase Mer
Ligand
BDBM497320
Substrate
Meas. Tech.
Activity Assay
IC50
<3±n/a nM
Citation
 Wang, XZheng, HZhao, JZhang, WFrye, SV Alkyl pyrrolopyrimidine analogs and methods of making and using same US Patent  US11001586 Publication Date 5/11/2021 
Target
Name:
Tyrosine-protein kinase Mer
Synonyms:
MER MERTK Proto-oncogene c-Mer Receptor tyrosine kinase MerTK | Tyrosine-protein kinase Mer
Type:
PROTEIN
Mol. Mass.:
110234.77
Organism:
Homo sapiens (Human)
Description:
ChEMBL_1498723
Residue:
999
  
Inhibitor
Name:
BDBM497320
Synonyms:
(1S,4r)-4-(2-(((S)-pentan-2- yl)amino)-5-(pyrrolidin-3- yl)-7H-pyrrolo[2,3- d]pyrimidin-7- yl)cyclohexan-1-ol | US11001586, Example 98
Type:
Small organic molecule
Emp. Form.:
C21H33N5O
Mol. Mass.:
371.5196
SMILES:
CCC[C@H](C)Nc1ncc2c(cn([C@H]3CC[C@H](O)CC3)c2n1)C1CCNC1
: