Target
Dihydrofolate reductase
Ligand
BDBM497336
Substrate
Meas. Tech.
TBD
IC50
234±n/a nM
Citation
 Gangjee, A Pyrimidine compounds and pyrimido indole compounds and methods of use US Patent  US11001595 Publication Date 5/11/2021 
Target
Name:
Dihydrofolate reductase
Synonyms:
Type:
Protein
Mol. Mass.:
23415.37
Organism:
Human pneumocystis pneumonia agent
Description:
A0A0W4ZHR8
Residue:
206
  
Inhibitor
Name:
BDBM497336
Synonyms:
US11001595, Compound 9 | US11111252, Compound 9
Type:
Small organic molecule
Emp. Form.:
C16H19N5O2S
Mol. Mass.:
345.419
SMILES:
COc1ccc(Sc2c(C)c3c(N)nc(N)nc3n2C)cc1OC
: